Reaction Details
TargetTyrosine-protein phosphatase non-receptor type 12
LigandBDBM50393493
Substrate/Competitorn/a
Meas. Tech.ChEMBL_855962 (CHEMBL2161836)
IC50 18000±n/a nM
Citation Stanford, SMKrishnamurthy, DFalk, MDMessina, RDebnath, BLi, SLiu, TKazemi, RDahl, RHe, YYu, XChan, ACZhang, ZYBarrios, AMWoods, VLNeamati, NBottini, N Discovery of a novel series of inhibitors of lymphoid tyrosine phosphatase with activity in human T cells. J Med Chem54:1640-54 (2011) 
 
Tyrosine-protein phosphatase non-receptor type 12
Name:Tyrosine-protein phosphatase non-receptor type 12
Type:Protein
Mol. Mass.:88089.78
Organism:Homo sapiens (Human)
Description:Q05209
Residue:780
BDBM50393493
NameBDBM50393493
Synonyms:CHEMBL2159934
TypeSmall organic molecule
Emp. Form.C21H19N3O2S
Mol. Mass.377.459
SMILESCOc1ccc2cc(C#N)c(SCC(=O)Nc3cccc(C)c3C)nc2c1