Reaction Details
TargetTyrosine-protein phosphatase non-receptor type 7
LigandBDBM50393499
Substrate/Competitorn/a
Meas. Tech.ChEMBL_855971 (CHEMBL2161972)
IC50 22000±n/a nM
Citation Stanford, SMKrishnamurthy, DFalk, MDMessina, RDebnath, BLi, SLiu, TKazemi, RDahl, RHe, YYu, XChan, ACZhang, ZYBarrios, AMWoods, VLNeamati, NBottini, N Discovery of a novel series of inhibitors of lymphoid tyrosine phosphatase with activity in human T cells. J Med Chem54:1640-54 (2011) 
 
Tyrosine-protein phosphatase non-receptor type 7
Name:Tyrosine-protein phosphatase non-receptor type 7
Type:Protein
Mol. Mass.:40530.79
Organism:Homo sapiens (Human)
Description:P35236
Residue:360
BDBM50393499
NameBDBM50393499
Synonyms:CHEMBL2159931
TypeSmall organic molecule
Emp. Form.C19H14ClN3OS
Mol. Mass.367.852
SMILESCc1cccc2cc(C#N)c(SCC(=O)Nc3cccc(Cl)c3)nc12