Reaction Details
TargetLow molecular weight phosphotyrosine protein phosphatase
LigandBDBM50393500
Substrate/Competitorn/a
Meas. Tech.ChEMBL_855961 (CHEMBL2161835)
IC50 45300±n/a nM
Citation Stanford, SMKrishnamurthy, DFalk, MDMessina, RDebnath, BLi, SLiu, TKazemi, RDahl, RHe, YYu, XChan, ACZhang, ZYBarrios, AMWoods, VLNeamati, NBottini, N Discovery of a novel series of inhibitors of lymphoid tyrosine phosphatase with activity in human T cells. J Med Chem54:1640-54 (2011) 
 
Low molecular weight phosphotyrosine protein phosphatase
Name:Low molecular weight phosphotyrosine protein phosphatase
Type:n/a
Mol. Mass.:18042.81
Organism:Homo sapiens (Human)
Description:P24666
Residue:158
BDBM50393500
NameBDBM50393500
Synonyms:CHEMBL2159726
TypeSmall organic molecule
Emp. Form.C20H23N3OS
Mol. Mass.353.481
SMILESCc1ccc2cc(C#N)c(SCC(=O)NC3CCCCC3)nc2c1C