Reaction Details
TargetLow molecular weight phosphotyrosine protein phosphatase
LigandBDBM50393502
Substrate/Competitorn/a
Meas. Tech.ChEMBL_855961 (CHEMBL2161835)
IC50>90000±n/a nM
Citation Stanford, SMKrishnamurthy, DFalk, MDMessina, RDebnath, BLi, SLiu, TKazemi, RDahl, RHe, YYu, XChan, ACZhang, ZYBarrios, AMWoods, VLNeamati, NBottini, N Discovery of a novel series of inhibitors of lymphoid tyrosine phosphatase with activity in human T cells. J Med Chem54:1640-54 (2011) 
 
Low molecular weight phosphotyrosine protein phosphatase
Name:Low molecular weight phosphotyrosine protein phosphatase
Type:n/a
Mol. Mass.:18042.81
Organism:Homo sapiens (Human)
Description:P24666
Residue:158
BDBM50393502
NameBDBM50393502
Synonyms:CHEMBL2159929
TypeSmall organic molecule
Emp. Form.C20H15N3O3S
Mol. Mass.377.416
SMILESCc1ccc2cc(C#N)c(SCC(=O)Nc3ccc4OCOc4c3)nc2c1