Reaction Details
TargetTyrosine-protein phosphatase non-receptor type 22
LigandBDBM50393491
Substrate/Competitorn/a
Meas. Tech.ChEMBL_855963 (CHEMBL2161837)
IC50 28100±n/a nM
Citation Stanford, SMKrishnamurthy, DFalk, MDMessina, RDebnath, BLi, SLiu, TKazemi, RDahl, RHe, YYu, XChan, ACZhang, ZYBarrios, AMWoods, VLNeamati, NBottini, N Discovery of a novel series of inhibitors of lymphoid tyrosine phosphatase with activity in human T cells. J Med Chem54:1640-54 (2011) 
 
Tyrosine-protein phosphatase non-receptor type 22
Name:Tyrosine-protein phosphatase non-receptor type 22
Type:n/a
Mol. Mass.:91712.31
Organism:Homo sapiens (Human)
Description:Q9Y2R2
Residue:807
BDBM50393491
NameBDBM50393491
Synonyms:CHEMBL2159932
TypeSmall organic molecule
Emp. Form.C22H21N3O2S
Mol. Mass.391.486
SMILESCCOc1ccc(NC(=O)CSc2nc3c(C)cc(C)cc3cc2C#N)cc1