Reaction Details
TargetTyrosine-protein phosphatase non-receptor type 22
LigandBDBM50393493
Substrate/Competitorn/a
Meas. Tech.ChEMBL_855963 (CHEMBL2161837)
IC50 30500±n/a nM
Citation Stanford, SMKrishnamurthy, DFalk, MDMessina, RDebnath, BLi, SLiu, TKazemi, RDahl, RHe, YYu, XChan, ACZhang, ZYBarrios, AMWoods, VLNeamati, NBottini, N Discovery of a novel series of inhibitors of lymphoid tyrosine phosphatase with activity in human T cells. J Med Chem54:1640-54 (2011) 
 
Tyrosine-protein phosphatase non-receptor type 22
Name:Tyrosine-protein phosphatase non-receptor type 22
Type:n/a
Mol. Mass.:91712.31
Organism:Homo sapiens (Human)
Description:Q9Y2R2
Residue:807
BDBM50393493
NameBDBM50393493
Synonyms:CHEMBL2159934
TypeSmall organic molecule
Emp. Form.C21H19N3O2S
Mol. Mass.377.459
SMILESCOc1ccc2cc(C#N)c(SCC(=O)Nc3cccc(C)c3C)nc2c1