Reaction Details
TargetcAMP-specific 3',5'-cyclic phosphodiesterase 4A
LigandBDBM50393517
Substrate/Competitorn/a
Meas. Tech.ChEMBL_856424 (CHEMBL2161156)
IC50 4300±n/a nM
Citation Day, JPLindsay, BRiddell, TJiang, ZAllcock, RWAbraham, ASookup, SChristian, FBogum, JMartin, EKRae, RLAnthony, DRosair, GMHouslay, DMHuston, EBaillie, GSKlussmann, EHouslay, MDAdams, DR Elucidation of a structural basis for the inhibitor-driven, p62 (SQSTM1)-dependent intracellular redistribution of cAMP phosphodiesterase-4A4 (PDE4A4). J Med Chem54:3331-47 (2011) 
 
cAMP-specific 3',5'-cyclic phosphodiesterase 4A
Name:cAMP-specific 3',5'-cyclic phosphodiesterase 4A
Type:Enzyme
Mol. Mass.:98113.27
Organism:Homo sapiens (Human)
Description:P27815
Residue:886
BDBM50393517
NameBDBM50393517
Synonyms:CHEMBL2158063
TypeSmall organic molecule
Emp. Form.C23H27NO3
Mol. Mass.365.4654
SMILESCOc1ccc(cc1OC1CCCC1)[C@@H]1CN(Cc2ccccc2)C(=O)C1