Reaction Details
TargetcAMP-specific 3',5'-cyclic phosphodiesterase 4A
LigandBDBM50393510
Substrate/Competitorn/a
Meas. Tech.ChEMBL_856427 (CHEMBL2161159)
EC50 17±n/a nM
Citation Day, JPLindsay, BRiddell, TJiang, ZAllcock, RWAbraham, ASookup, SChristian, FBogum, JMartin, EKRae, RLAnthony, DRosair, GMHouslay, DMHuston, EBaillie, GSKlussmann, EHouslay, MDAdams, DR Elucidation of a structural basis for the inhibitor-driven, p62 (SQSTM1)-dependent intracellular redistribution of cAMP phosphodiesterase-4A4 (PDE4A4). J Med Chem54:3331-47 (2011) 
 
cAMP-specific 3',5'-cyclic phosphodiesterase 4A
Name:cAMP-specific 3',5'-cyclic phosphodiesterase 4A
Type:Enzyme
Mol. Mass.:98113.27
Organism:Homo sapiens (Human)
Description:P27815
Residue:886
BDBM50393510
NameBDBM50393510
Synonyms:CHEMBL1232082
TypeSmall organic molecule
Emp. Form.C19H13N5O4
Mol. Mass.375.3376
SMILES[O-][N+](=O)c1cccc(c1)-n1c2ncccc2c(=O)n(Cc2ccncc2)c1=O