Reaction Details
TargetcAMP-specific 3',5'-cyclic phosphodiesterase 4A
LigandBDBM50108504
Substrate/Competitorn/a
Meas. Tech.ChEMBL_856427 (CHEMBL2161159)
EC50 250±n/a nM
Citation Day, JPLindsay, BRiddell, TJiang, ZAllcock, RWAbraham, ASookup, SChristian, FBogum, JMartin, EKRae, RLAnthony, DRosair, GMHouslay, DMHuston, EBaillie, GSKlussmann, EHouslay, MDAdams, DR Elucidation of a structural basis for the inhibitor-driven, p62 (SQSTM1)-dependent intracellular redistribution of cAMP phosphodiesterase-4A4 (PDE4A4). J Med Chem54:3331-47 (2011) 
 
cAMP-specific 3',5'-cyclic phosphodiesterase 4A
Name:cAMP-specific 3',5'-cyclic phosphodiesterase 4A
Type:Enzyme
Mol. Mass.:98113.27
Organism:Homo sapiens (Human)
Description:P27815
Residue:886
BDBM50108504
NameBDBM50108504
Synonyms:4-(8-(benzo[c][1,2,5]oxadiazol-5-yl)-1,7-naphthyridin-6-yl)benzoic acid CHEMBL77826
TypeSmall organic molecule
Emp. Form.C21H12N4O3
Mol. Mass.368.345
SMILESOC(=O)c1ccc(cc1)-c1cc2cccnc2c(n1)-c1ccc2nonc2c1