Reaction Details
TargetE3 ubiquitin-protein ligase XIAP
LigandBDBM50273673
Substrate/Competitorn/a
Meas. Tech.ChEMBL_855619 (CHEMBL2160290)
EC50 18000±n/a nM
Citation Peng, YSun, HLu, JLiu, LCai, QShen, RYang, CYYi, HWang, S Bivalent Smac mimetics with a diazabicyclic core as highly potent antagonists of XIAP and cIAP1/2 and novel anticancer agents. J Med Chem55:106-14 (2012) 
 
E3 ubiquitin-protein ligase XIAP
Name:E3 ubiquitin-protein ligase XIAP
Type:Protein
Mol. Mass.:56685.27
Organism:Homo sapiens (Human)
Description:P98170
Residue:497
BDBM50273673
NameBDBM50273673
Synonyms:(5S,8S,10aR)-N-Benzhydryl-5-((S)-2-(methylamino)propanamido)-6-oxodeca-hydropyrrolo[1,2-a][1,5]diazocine-8-carboxamide | CHEMBL459541
TypeSmall organic molecule
Emp. Form.C27H35N5O3
Mol. Mass.477.5985
SMILESCN[C@@H](C)C(=O)N[C@H]1CNCC[C@H]2CC[C@H](N2C1=O)C(=O)NC(c1ccccc1)c1ccccc1