Reaction Details
TargetBaculoviral IAP repeat-containing protein 2
LigandBDBM50273698
Substrate/Competitorn/a
Meas. Tech.ChEMBL_855617 (CHEMBL2160288)
Ki 1.1±n/a nM
Citation Peng, YSun, HLu, JLiu, LCai, QShen, RYang, CYYi, HWang, S Bivalent Smac mimetics with a diazabicyclic core as highly potent antagonists of XIAP and cIAP1/2 and novel anticancer agents. J Med Chem55:106-14 (2012) 
 
Baculoviral IAP repeat-containing protein 2
Name:Baculoviral IAP repeat-containing protein 2
Type:Protein
Mol. Mass.:69900.47
Organism:Homo sapiens (Human)
Description:Q13490
Residue:618
BDBM50273698
NameBDBM50273698
Synonyms:(5S,8S,10aR)-3-Acetyl-N-benzhydryl-5-((S)-2-(methylamino)-propanamido)-6-oxodeca-hydro pyrrolo[1,2-a][1,5]diazocine-8-carbox-amide | CHEMBL456400
TypeSmall organic molecule
Emp. Form.C29H37N5O4
Mol. Mass.519.6352
SMILESCN[C@@H](C)C(=O)N[C@H]1CN(CC[C@H]2CC[C@H](N2C1=O)C(=O)NC(c1ccccc1)c1ccccc1)C(C)=O