Reaction Details
TargetTrifunctional purine biosynthetic protein adenosine-3
LigandBDBM50306576
Substrate/Competitorn/a
Meas. Tech.ChEMBL_855845 (CHEMBL2161359)
IC50 3.46±n/a nM
Citation Wang, LCherian, CKugel Desmoulin, SMitchell-Ryan, SHou, ZMatherly, LHGangjee, A Synthesis and biological activity of 6-substituted pyrrolo[2,3-d]pyrimidine thienoyl regioisomers as inhibitors of de novo purine biosynthesis with selectivity for cellular uptake by high affinity folate receptors and the proton-coupled folate transporter over the reduced folate carrier. J Med Chem55:1758-70 (2012) 
 
Trifunctional purine biosynthetic protein adenosine-3
Name:Trifunctional purine biosynthetic protein adenosine-3
Type:Protein
Mol. Mass.:107768.47
Organism:Homo sapiens (Human)
Description:P22102
Residue:1010
BDBM50306576
NameBDBM50306576
Synonyms:(S)-2-({5-[4-(2-Amino-4-oxo-4,7-dihydro-3H-pyrrolo[2,3-d]-pyrimidin-6-yl)-butyl]-thiophene-2-carbonyl}-amino)-pentanedioicAcid CHEMBL590740
TypeSmall organic molecule
Emp. Form.C20H23N5O6S
Mol. Mass.461.492
SMILESNc1nc2[nH]c(CCCCc3ccc(s3)C(=O)N[C@@H](CCC(O)=O)C(O)=O)cc2c(=O)[nH]1