Reaction Details
TargetProton-coupled folate transporter
LigandBDBM50393639
Substrate/Competitorn/a
Meas. Tech.ChEMBL_855843 (CHEMBL2161357)
pH6.8±n/a
Ki 30700±n/a nM
Commentsextracted
Citation Wang, LCherian, CKugel Desmoulin, SMitchell-Ryan, SHou, ZMatherly, LHGangjee, A Synthesis and biological activity of 6-substituted pyrrolo[2,3-d]pyrimidine thienoyl regioisomers as inhibitors of de novo purine biosynthesis with selectivity for cellular uptake by high affinity folate receptors and the proton-coupled folate transporter over the reduced folate carrier. J Med Chem55:1758-70 (2012) 
 
Proton-coupled folate transporter
Name:Proton-coupled folate transporter
Type:PROTEIN
Mol. Mass.:49782.13
Organism:Homo sapiens (Human)
Description:ChEMBL_1469597
Residue:459
BDBM50393639
NameBDBM50393639
Synonyms:CHEMBL2158682
TypeSmall organic molecule
Emp. Form.C20H23N5O6S
Mol. Mass.461.492
SMILESNc1nc2[nH]c(CCCCc3cc(cs3)C(=O)N[C@@H](CCC(O)=O)C(O)=O)cc2c(=O)[nH]1