Reaction Details
TargetQuinolone resistance protein NorA
LigandBDBM50017712
Substrate/Competitorn/a
Meas. Tech.ChEMBL_856643 (CHEMBL2162180)
IC50 8200±n/a nM
Citation Holler, JGSlotved, HCMølgaard, POlsen, CEChristensen, SB Chalcone inhibitors of the NorA efflux pump in Staphylococcus aureus whole cells and enriched everted membrane vesicles. Bioorg Med Chem20:4514-21 (2012) 
 
Quinolone resistance protein NorA
Name:Quinolone resistance protein NorA
Type:PROTEIN
Mol. Mass.:42273.03
Organism:Staphylococcus aureus
Description:ChEMBL_961221
Residue:388
BDBM50017712
NameBDBM50017712
Synonyms:(-)-reserpine 3,4,5-trimethoxybenzoyl methyl reserpate CHEMBL772 RESERPINE Serpalan methyl (3beta,16beta,17alpha,18beta,20alpha)-11,17-dimethoxy-18-[(3,4,5-trimethoxybenzoyl)oxy]yohimban-16-carboxylate
TypeSmall organic molecule
Emp. Form.C33H40N2O9
Mol. Mass.608.6787
SMILESCO[C@H]1[C@@H](C[C@@H]2CN3CCc4c([nH]c5cc(OC)ccc45)[C@H]3C[C@@H]2[C@@H]1C(=O)OC)OC(=O)c1cc(OC)c(OC)c(OC)c1