Reaction Details
TargetQuinolone resistance protein NorA
LigandBDBM50393707
Substrate/Competitorn/a
Meas. Tech.ChEMBL_856643 (CHEMBL2162180)
IC50 9000±n/a nM
Citation Holler, JGSlotved, HCMølgaard, POlsen, CEChristensen, SB Chalcone inhibitors of the NorA efflux pump in Staphylococcus aureus whole cells and enriched everted membrane vesicles. Bioorg Med Chem20:4514-21 (2012) 
 
Quinolone resistance protein NorA
Name:Quinolone resistance protein NorA
Type:PROTEIN
Mol. Mass.:42273.03
Organism:Staphylococcus aureus
Description:ChEMBL_961221
Residue:388
BDBM50393707
NameBDBM50393707
Synonyms:CHEMBL2158998
TypeSmall organic molecule
Emp. Form.C25H25NO3
Mol. Mass.387.4709
SMILESCN(C)CCOc1ccc(cc1)C(=O)\C=C\c1ccc(Oc2ccccc2)cc1