Reaction Details
TargetDelta-type opioid receptor
LigandBDBM50393722
Substrate/Competitorn/a
Meas. Tech.ChEMBL_856832 (CHEMBL2163097)
EC50 35±n/a nM
Citation Breslin, HJDiamond, CJKavash, RWCai, CDyatkin, ABMiskowski, TAZhang, SPWade, PRHornby, PJHe, W Identification of a duald OR antagonist/µ OR agonist as a potential therapeutic for diarrhea-predominant Irritable Bowel Syndrome (IBS-d). Bioorg Med Chem Lett22:4869-72 (2012) 
 
Delta-type opioid receptor
Name:Delta-type opioid receptor
Type:G Protein-Coupled Receptor (GPCR)
Mol. Mass.:40382.98
Organism:Homo sapiens (Human)
Description:Competition binding assays were carried out using membrane preparations from transfected HN9.10 cells that constitutively expressed the delta opioid receptor.
Residue:372
BDBM50393722
NameBDBM50393722
Synonyms:CHEMBL2159119
TypeSmall organic molecule
Emp. Form.C30H33N5O2
Mol. Mass.495.6153
SMILESC[C@H](N(Cc1ccccc1)C(=O)[C@@H](N)Cc1c(C)cc(cc1C)C(N)=O)c1nc(c[nH]1)-c1ccccc1