Reaction Details
TargetMu-type opioid receptor
LigandBDBM50393718
Substrate/Competitorn/a
Meas. Tech.ChEMBL_856831 (CHEMBL2163096)
Ki 17±n/a nM
Citation Breslin, HJDiamond, CJKavash, RWCai, CDyatkin, ABMiskowski, TAZhang, SPWade, PRHornby, PJHe, W Identification of a duald OR antagonist/µ OR agonist as a potential therapeutic for diarrhea-predominant Irritable Bowel Syndrome (IBS-d). Bioorg Med Chem Lett22:4869-72 (2012) 
 
Mu-type opioid receptor
Name:Mu-type opioid receptor
Type:G Protein-Coupled Receptor (GPCR)
Mol. Mass.:44503.11
Organism:Rattus norvegicus (rat)
Description:Competition binding assays were carried out using membrane preparations from transfected HN9.10 cells that constitutively expressed the mu opioid receptor.
Residue:398
BDBM50393718
NameBDBM50393718
Synonyms:CHEMBL2159111
TypeSmall organic molecule
Emp. Form.C22H26N4O2
Mol. Mass.378.4674
SMILESC[C@H](NC(=O)[C@@H](N)Cc1c(C)cc(O)cc1C)c1nc(c[nH]1)-c1ccccc1