Reaction Details
TargetKappa-type opioid receptor
LigandBDBM50393720
Substrate/Competitorn/a
Meas. Tech.ChEMBL_856836 (CHEMBL2163101)
Ki 55±n/a nM
Citation Breslin, HJDiamond, CJKavash, RWCai, CDyatkin, ABMiskowski, TAZhang, SPWade, PRHornby, PJHe, W Identification of a duald OR antagonist/µ OR agonist as a potential therapeutic for diarrhea-predominant Irritable Bowel Syndrome (IBS-d). Bioorg Med Chem Lett22:4869-72 (2012) 
 
Kappa-type opioid receptor
Name:Kappa-type opioid receptor
Type:G Protein-Coupled Receptor (GPCR)
Mol. Mass.:42744.99
Organism:Cavia porcellus (domestic guinea pig)
Description:P41144
Residue:380
BDBM50393720
NameBDBM50393720
Synonyms:CHEMBL2159122 | CHEMBL3216329
TypeSmall organic molecule
Emp. Form.C32H37Cl2N5O5
Mol. Mass.642.573
SMILESCl.Cl.COc1ccc(CN(C(C)c2nc(c[nH]2)-c2ccccc2)C(=O)C(N)Cc2c(C)cc(cc2C)C(N)=O)cc1C(O)=O