Reaction Details
TargetMu-type opioid receptor
LigandBDBM50182939
Substrate/Competitorn/a
Meas. Tech.ChEMBL_856831 (CHEMBL2163096)
Ki 0.050000±n/a nM
Citation Breslin, HJDiamond, CJKavash, RWCai, CDyatkin, ABMiskowski, TAZhang, SPWade, PRHornby, PJHe, W Identification of a duald OR antagonist/µ OR agonist as a potential therapeutic for diarrhea-predominant Irritable Bowel Syndrome (IBS-d). Bioorg Med Chem Lett22:4869-72 (2012) 
 
Mu-type opioid receptor
Name:Mu-type opioid receptor
Type:G Protein-Coupled Receptor (GPCR)
Mol. Mass.:44503.11
Organism:Rattus norvegicus (rat)
Description:Competition binding assays were carried out using membrane preparations from transfected HN9.10 cells that constitutively expressed the mu opioid receptor.
Residue:398
BDBM50182939
NameBDBM50182939
Synonyms:(S)-2-amino-3-(4-hydroxy-2,6-dimethylphenyl)-1-((S)-2-(4-phenyl-1H-imidazol-2-yl)piperidin-1-yl)propan-1-one | CHEMBL377069
TypeSmall organic molecule
Emp. Form.C25H30N4O2
Mol. Mass.418.5313
SMILESCc1cc(O)cc(C)c1C[C@H](N)C(=O)N1CCCC[C@H]1c1nc(c[nH]1)-c1ccccc1