Reaction Details
TargetMu-type opioid receptor
LigandBDBM50393724
Substrate/Competitorn/a
Meas. Tech.ChEMBL_856831 (CHEMBL2163096)
Ki 1±n/a nM
Citation Breslin, HJDiamond, CJKavash, RWCai, CDyatkin, ABMiskowski, TAZhang, SPWade, PRHornby, PJHe, W Identification of a duald OR antagonist/µ OR agonist as a potential therapeutic for diarrhea-predominant Irritable Bowel Syndrome (IBS-d). Bioorg Med Chem Lett22:4869-72 (2012) 
 
Mu-type opioid receptor
Name:Mu-type opioid receptor
Type:G Protein-Coupled Receptor (GPCR)
Mol. Mass.:44503.11
Organism:Rattus norvegicus (rat)
Description:Competition binding assays were carried out using membrane preparations from transfected HN9.10 cells that constitutively expressed the mu opioid receptor.
Residue:398
BDBM50393724
NameBDBM50393724
Synonyms:CHEMBL2159120
TypeSmall organic molecule
Emp. Form.C31H33N5O4
Mol. Mass.539.6248
SMILESC[C@H](N(Cc1cccc(c1)C(O)=O)C(=O)[C@@H](N)Cc1c(C)cc(cc1C)C(N)=O)c1nc(c[nH]1)-c1ccccc1