Reaction Details
TargetMu-type opioid receptor
LigandBDBM50393720
Substrate/Competitorn/a
Meas. Tech.ChEMBL_856831 (CHEMBL2163096)
Ki 0.900000±n/a nM
Citation Breslin, HJDiamond, CJKavash, RWCai, CDyatkin, ABMiskowski, TAZhang, SPWade, PRHornby, PJHe, W Identification of a duald OR antagonist/µ OR agonist as a potential therapeutic for diarrhea-predominant Irritable Bowel Syndrome (IBS-d). Bioorg Med Chem Lett22:4869-72 (2012) 
 
Mu-type opioid receptor
Name:Mu-type opioid receptor
Type:G Protein-Coupled Receptor (GPCR)
Mol. Mass.:44503.11
Organism:Rattus norvegicus (rat)
Description:Competition binding assays were carried out using membrane preparations from transfected HN9.10 cells that constitutively expressed the mu opioid receptor.
Residue:398
BDBM50393720
NameBDBM50393720
Synonyms:CHEMBL2159122 | CHEMBL3216329
TypeSmall organic molecule
Emp. Form.C32H37Cl2N5O5
Mol. Mass.642.573
SMILESCl.Cl.COc1ccc(CN(C(C)c2nc(c[nH]2)-c2ccccc2)C(=O)C(N)Cc2c(C)cc(cc2C)C(N)=O)cc1C(O)=O