Reaction Details
TargetDelta-type opioid receptor
LigandBDBM50393728
Substrate/Competitorn/a
Meas. Tech.ChEMBL_856830 (CHEMBL2163095)
Ki 5660±n/a nM
Citation Breslin, HJDiamond, CJKavash, RWCai, CDyatkin, ABMiskowski, TAZhang, SPWade, PRHornby, PJHe, W Identification of a duald OR antagonist/µ OR agonist as a potential therapeutic for diarrhea-predominant Irritable Bowel Syndrome (IBS-d). Bioorg Med Chem Lett22:4869-72 (2012) 
 
Delta-type opioid receptor
Name:Delta-type opioid receptor
Type:G Protein-Coupled Receptor (GPCR)
Mol. Mass.:40465.04
Organism:Rattus norvegicus (rat)
Description:Competition binding assays were using CHO-K1 cell membranes expressing the opioid receptor.
Residue:372
BDBM50393728
NameBDBM50393728
Synonyms:CHEMBL2159015
TypeSmall organic molecule
Emp. Form.C20H22N4O2
Mol. Mass.350.4143
SMILESC[C@H](NC(=O)[C@@H](N)Cc1ccc(O)cc1)c1nc(c[nH]1)-c1ccccc1