Reaction Details
TargetGlucagon receptor
LigandBDBM50393783
Substrate/Competitorn/a
Meas. Tech.ChEMBL_857260 (CHEMBL2160605)
IC50 11±n/a nM
Citation Xiong, YGuo, JCandelore, MRLiang, RMiller, CDallas-Yang, QJiang, GMcCann, PEQureshi, SATong, XXu, SSShang, JVincent, SHTota, LMWright, MJYang, XZhang, BBTata, JRParmee, ER Discovery of a novel glucagon receptor antagonist N-[(4-{(1S)-1-[3-(3, 5-dichlorophenyl)-5-(6-methoxynaphthalen-2-yl)-1H-pyrazol-1-yl]ethyl}phenyl)carbonyl]-ß-alanine (MK-0893) for the treatment of type II diabetes. J Med Chem55:6137-48 (2012) 
 
Glucagon receptor
Name:Glucagon receptor
Type:Enzyme
Mol. Mass.:54026.92
Organism:Homo sapiens (Human)
Description:P47871
Residue:477
BDBM50393783
NameBDBM50393783
Synonyms:CHEMBL2159339
TypeSmall organic molecule
Emp. Form.C32H24Cl2F3N3O3
Mol. Mass.626.452
SMILESC[C@@H](c1ccc(cc1)C(=O)NCCC(O)=O)n1nc(cc1-c1ccc2cc(ccc2c1)C(F)(F)F)-c1cc(Cl)cc(Cl)c1