Reaction Details
TargetGlucagon receptor
LigandBDBM50393770
Substrate/Competitorn/a
Meas. Tech.ChEMBL_857260 (CHEMBL2160605)
IC50 8.1±n/a nM
Citation Xiong, YGuo, JCandelore, MRLiang, RMiller, CDallas-Yang, QJiang, GMcCann, PEQureshi, SATong, XXu, SSShang, JVincent, SHTota, LMWright, MJYang, XZhang, BBTata, JRParmee, ER Discovery of a novel glucagon receptor antagonist N-[(4-{(1S)-1-[3-(3, 5-dichlorophenyl)-5-(6-methoxynaphthalen-2-yl)-1H-pyrazol-1-yl]ethyl}phenyl)carbonyl]-ß-alanine (MK-0893) for the treatment of type II diabetes. J Med Chem55:6137-48 (2012) 
 
Glucagon receptor
Name:Glucagon receptor
Type:Enzyme
Mol. Mass.:54026.92
Organism:Homo sapiens (Human)
Description:P47871
Residue:477
BDBM50393770
NameBDBM50393770
Synonyms:CHEMBL2159331
TypeSmall organic molecule
Emp. Form.C31H22Cl2F3N3O4
Mol. Mass.628.425
SMILESOC(=O)CCNC(=O)c1ccc(Cn2nc(cc2-c2ccc3cc(OC(F)(F)F)ccc3c2)-c2cc(Cl)cc(Cl)c2)cc1