Reaction Details
TargetMethionine--tRNA ligase, cytoplasmic
LigandBDBM50393797
Substrate/Competitorn/a
Meas. Tech.ChEMBL_854755 (CHEMBL2161886)
IC50 4349±n/a nM
Citation Shibata, SGillespie, JRRanade, RMKoh, CYKim, JELaydbak, JUZucker, FHHol, WGVerlinde, CLBuckner, FSFan, E Urea-based inhibitors of Trypanosoma brucei methionyl-tRNA synthetase: selectivity and in vivo characterization. J Med Chem55:6342-51 (2012) 
 
Methionine--tRNA ligase, cytoplasmic
Name:Methionine--tRNA ligase, cytoplasmic
Type:PROTEIN
Mol. Mass.:101110.04
Organism:Homo sapiens (Human)
Description:ChEMBL_105283
Residue:900
BDBM50393797
NameBDBM50393797
Synonyms:CHEMBL2159535
TypeSmall organic molecule
Emp. Form.C15H17Cl2N3OS
Mol. Mass.358.286
SMILESClc1cc(Cl)cc(CNCCCNC(=O)Nc2ccsc2)c1