Reaction Details
TargetAndrogen receptor
LigandBDBM50393802
Substrate/Competitorn/a
Meas. Tech.ChEMBL_854887 (CHEMBL2162624)
IC50 741.31±n/a nM
Citation Poutiainen, PKOravilahti, TPeräkylä, MPalvimo, JJIhalainen, JALaatikainen, RPulkkinen, JT Design, synthesis, and biological evaluation of nonsteroidal cycloalkane[d]isoxazole-containing androgen receptor modulators. J Med Chem55:6316-27 (2012) 
 
Androgen receptor
Name:Androgen receptor
Type:Receptor
Mol. Mass.:99185.27
Organism:Homo sapiens (Human)
Description:CHO cells were stably transfected with human AR gene.
Residue:920
BDBM50393802
NameBDBM50393802
Synonyms:CHEMBL2159548
TypeSmall organic molecule
Emp. Form.C16H17F3N2O3
Mol. Mass.342.313
SMILES[O-][N+](=O)c1ccc(C2=NOC3CCCCCCC23)c(c1)C(F)(F)F