Reaction Details
TargetAndrogen receptor
LigandBDBM50393819
Substrate/Competitorn/a
Meas. Tech.ChEMBL_854887 (CHEMBL2162624)
IC50 64.6±n/a nM
Citation Poutiainen, PKOravilahti, TPeräkylä, MPalvimo, JJIhalainen, JALaatikainen, RPulkkinen, JT Design, synthesis, and biological evaluation of nonsteroidal cycloalkane[d]isoxazole-containing androgen receptor modulators. J Med Chem55:6316-27 (2012) 
 
Androgen receptor
Name:Androgen receptor
Type:Receptor
Mol. Mass.:99185.27
Organism:Homo sapiens (Human)
Description:CHO cells were stably transfected with human AR gene.
Residue:920
BDBM50393819
NameBDBM50393819
Synonyms:CHEMBL2159568
TypeSmall organic molecule
Emp. Form.C15H13F3N2O
Mol. Mass.294.2717
SMILESFC(F)(F)c1c(cccc1C1=NOC2CCCCC12)C#N