Reaction Details
TargetCholinesterase
LigandBDBM50393854
Substrate/Competitorn/a
Meas. Tech.ChEMBL_855525 (CHEMBL2162681)
IC50 45.71±n/a nM
Citation Wang, YWang, FYu, JPJiang, FCGuan, XLWang, CMLi, LCao, HLi, MXChen, JG Novel multipotent phenylthiazole-tacrine hybrids for the inhibition of cholinesterase activity,ß-amyloid aggregation and Ca²¿ overload. Bioorg Med Chem20:6513-22 (2012) 
 
Cholinesterase
Name:Cholinesterase
Type:Enzyme
Mol. Mass.:65643.35
Organism:Equus caballus (Horse)
Description:P81908
Residue:574
BDBM50393854
NameBDBM50393854
Synonyms:CHEMBL2158126
TypeSmall organic molecule
Emp. Form.C31H36ClN5OS
Mol. Mass.562.168
SMILESCCN(CCCCNc1c2CCCCc2nc2ccccc12)CCC(=O)Nc1nc(cs1)-c1ccc(Cl)cc1