Reaction Details
TargetCholinesterase
LigandBDBM50393862
Substrate/Competitorn/a
Meas. Tech.ChEMBL_855525 (CHEMBL2162681)
IC50 14.79±n/a nM
Citation Wang, YWang, FYu, JPJiang, FCGuan, XLWang, CMLi, LCao, HLi, MXChen, JG Novel multipotent phenylthiazole-tacrine hybrids for the inhibition of cholinesterase activity,ß-amyloid aggregation and Ca²¿ overload. Bioorg Med Chem20:6513-22 (2012) 
 
Cholinesterase
Name:Cholinesterase
Type:Enzyme
Mol. Mass.:65643.35
Organism:Equus caballus (Horse)
Description:P81908
Residue:574
BDBM50393862
NameBDBM50393862
Synonyms:CHEMBL2158118
TypeSmall organic molecule
Emp. Form.C30H35N5OS
Mol. Mass.513.697
SMILESCCN(CCCCNc1c2CCCCc2nc2ccccc12)CC(=O)Nc1nc(cs1)-c1ccccc1