Reaction Details
TargetCholinesterase
LigandBDBM50393867
Substrate/Competitorn/a
Meas. Tech.ChEMBL_855525 (CHEMBL2162681)
IC50 0.55±n/a nM
Citation Wang, YWang, FYu, JPJiang, FCGuan, XLWang, CMLi, LCao, HLi, MXChen, JG Novel multipotent phenylthiazole-tacrine hybrids for the inhibition of cholinesterase activity,ß-amyloid aggregation and Ca²¿ overload. Bioorg Med Chem20:6513-22 (2012) 
 
Cholinesterase
Name:Cholinesterase
Type:Enzyme
Mol. Mass.:65643.35
Organism:Equus caballus (Horse)
Description:P81908
Residue:574
BDBM50393867
NameBDBM50393867
Synonyms:CHEMBL2158113
TypeSmall organic molecule
Emp. Form.C31H35N5O2S
Mol. Mass.541.707
SMILESO=C(CCCC(=O)Nc1nc(cs1)-c1ccccc1)NCCCCNc1c2CCCCc2nc2ccccc12