Reaction Details
TargetCruzipain
LigandBDBM50393871
Substrate/Competitorn/a
Meas. Tech.ChEMBL_855698 (CHEMBL2160678)
IC50 30±n/a nM
Citation dos Santos Filho, JMMoreira, DRde Simone, CAFerreira, RSMcKerrow, JHMeira, CSGuimarães, ETSoares, MB Optimization of anti-Trypanosoma cruzi oxadiazoles leads to identification of compounds with efficacy in infected mice. Bioorg Med Chem20:6423-33 (2012) 
 
Cruzipain
Name:Cruzipain
Type:Protein
Mol. Mass.:49831.41
Organism:Trypanosoma cruzi
Description:P25779
Residue:467
BDBM50393871
NameBDBM50393871
Synonyms:CHEMBL2158234
TypeSmall organic molecule
Emp. Form.C17H11BrN4O4
Mol. Mass.415.198
SMILESBrc1ccc(cc1)-c1noc(n1)C(=O)NN=Cc1ccc2OCOc2c1