Reaction Details
Target11-beta-hydroxysteroid dehydrogenase 1
LigandBDBM50394017
Substrate/Competitorn/a
Meas. Tech.ChEMBL_855921 (CHEMBL2161684)
IC50 4±n/a nM
Citation Scott, JSGill, ALGodfrey, LGroombridge, SDRees, ARevill, JSchofield, PSörme, PStocker, ASwales, JGWhittamore, PR Optimisation of pharmacokinetic properties in a neutral series of 11ß-HSD1 inhibitors. Bioorg Med Chem Lett22:6756-61 (2012) 
 
11-beta-hydroxysteroid dehydrogenase 1
Name:11-beta-hydroxysteroid dehydrogenase 1
Type:Enzyme
Mol. Mass.:32409.16
Organism:Homo sapiens (Human)
Description:P28845
Residue:292
BDBM50394017
NameBDBM50394017
Synonyms:CHEMBL2158470
TypeSmall organic molecule
Emp. Form.C23H33N3O3S
Mol. Mass.431.591
SMILESCCCSc1nc(ccc1C(=O)N[C@H]1C2CC3CC1C[C@](O)(C3)C2)N1CCOCC1