Reaction Details
TargetHeat shock protein HSP 90-beta
LigandBDBM50394063
Substrate/Competitorn/a
Meas. Tech.ChEMBL_856085 (CHEMBL2162319)
Ki 12±n/a nM
Citation Davies, NGBrowne, HDavis, BDrysdale, MJFoloppe, NGeoffrey, SGibbons, BHart, THubbard, RJensen, MRMansell, HMassey, AMatassova, NMoore, JDMurray, JPratt, RRay, SRobertson, ARoughley, SDSchoepfer, JScriven, KSimmonite, HStokes, SSurgenor, AWebb, PWood, MWright, LBrough, P Targeting conserved water molecules: design of 4-aryl-5-cyanopyrrolo[2,3-d]pyrimidine Hsp90 inhibitors using fragment-based screening and structure-based optimization. Bioorg Med Chem20:6770-89 (2012) 
 
Heat shock protein HSP 90-beta
Name:Heat shock protein HSP 90-beta
Type:Molecular Chaperone
Mol. Mass.:83229.45
Organism:Homo sapiens (Human)
Description:P08238
Residue:724
BDBM50394063
NameBDBM50394063
Synonyms:CHEMBL2158628
TypeSmall organic molecule
Emp. Form.C21H20ClF2N5O2S
Mol. Mass.479.931
SMILESCOc1cc(Cl)c(cc1OCCN1CCC(F)(F)C1)-c1nc(SC)nc2[nH]cc(C#N)c12