Reaction Details
TargetPotassium voltage-gated channel subfamily H member 2
LigandBDBM50394066
Substrate/Competitorn/a
Meas. Tech.ChEMBL_856088 (CHEMBL2162322)
IC50 3640±n/a nM
Citation Davies, NGBrowne, HDavis, BDrysdale, MJFoloppe, NGeoffrey, SGibbons, BHart, THubbard, RJensen, MRMansell, HMassey, AMatassova, NMoore, JDMurray, JPratt, RRay, SRobertson, ARoughley, SDSchoepfer, JScriven, KSimmonite, HStokes, SSurgenor, AWebb, PWood, MWright, LBrough, P Targeting conserved water molecules: design of 4-aryl-5-cyanopyrrolo[2,3-d]pyrimidine Hsp90 inhibitors using fragment-based screening and structure-based optimization. Bioorg Med Chem20:6770-89 (2012) 
 
Potassium voltage-gated channel subfamily H member 2
Name:Potassium voltage-gated channel subfamily H member 2
Type:Multi-pass membrane protein
Mol. Mass.:126672.65
Organism:Homo sapiens (Human)
Description:Q12809
Residue:1159
BDBM50394066
NameBDBM50394066
Synonyms:CHEMBL2158625
TypeSmall organic molecule
Emp. Form.C20H19Cl2N5OS
Mol. Mass.448.369
SMILESCSc1nc(-c2cc(OCCN3CCCC3)c(Cl)cc2Cl)c2c(c[nH]c2n1)C#N