Reaction Details
TargetHistone deacetylase 1
LigandBDBM19151
Substrate/Competitorn/a
Meas. Tech.ChEMBL_856336 (CHEMBL2160543)
IC50 36±n/a nM
Citation Hoque, MAArai, TNishino, NKim, HJIto, AYoshida, M Cyclic tetrapeptides with thioacetate tails or intramolecular disulfide bridge as potent inhibitors of histone deacetylases. Bioorg Med Chem Lett22:6770-2 (2012) 
 
Histone deacetylase 1
Name:Histone deacetylase 1
Type:Enzyme
Mol. Mass.:55090.27
Organism:Homo sapiens (Human)
Description:Q13547
Residue:482
BDBM19151
NameBDBM19151
Synonyms:(1S,4S,7Z,10S,16E,21R)-7-ethylidene-4,21-bis(propan-2-yl)-2-oxa-12,13-dithia-5,8,20,23-tetraazabicyclo[8.7.6]tricos-16-ene-3,6,9,19,22-pentone CHEMBL343448 FK228 | Romidepsin
TypeAntibiotic
Emp. Form.C24H36N4O6S2
Mol. Mass.540.696
SMILESC\C=C1/NC(=O)[C@H]2CSSCC\C=C\[C@H](CC(=O)N[C@H](C(C)C)C(=O)N2)OC(=O)[C@@H](NC1=O)C(C)C