Reaction Details
TargetHistone deacetylase 1
LigandBDBM19130
Substrate/Competitorn/a
Meas. Tech.ChEMBL_856336 (CHEMBL2160543)
IC50 23±n/a nM
Citation Hoque, MAArai, TNishino, NKim, HJIto, AYoshida, M Cyclic tetrapeptides with thioacetate tails or intramolecular disulfide bridge as potent inhibitors of histone deacetylases. Bioorg Med Chem Lett22:6770-2 (2012) 
 
Histone deacetylase 1
Name:Histone deacetylase 1
Type:Enzyme
Mol. Mass.:55090.27
Organism:Homo sapiens (Human)
Description:Q13547
Residue:482
BDBM19130
NameBDBM19130
Synonyms:(2E,4E,6R)-7-[4-(dimethylamino)phenyl]-N-hydroxy-4,6-dimethyl-7-oxohepta-2,4-dienamide TSA | Trichostatin A (TSA)
TypeSmall organic molecule
Emp. Form.C17H22N2O3
Mol. Mass.302.3682
SMILESCC(C=CC(=O)NO)C=C(C)C(=O)c1ccc(cc1)N(C)C