Reaction Details
TargetPotassium voltage-gated channel subfamily H member 2
LigandBDBM50394112
Substrate/Competitorn/a
Meas. Tech.ChEMBL_856368 (CHEMBL2160723)
IC50>100000±n/a nM
Citation Bahl, ABarton, PBowers, KCaffrey, MVDenton, RGilmour, PHawley, SLinannen, TLuckhurst, CAMochel, TPerry, MWRiley, RJRoe, ESpringthorpe, BStein, LWebborn, P Scaffold-hopping with zwitterionic CCR3 antagonists: identification and optimisation of a series with good potency and pharmacokinetics leading to the discovery of AZ12436092. Bioorg Med Chem Lett22:6694-9 (2012) 
 
Potassium voltage-gated channel subfamily H member 2
Name:Potassium voltage-gated channel subfamily H member 2
Type:Multi-pass membrane protein
Mol. Mass.:126672.65
Organism:Homo sapiens (Human)
Description:Q12809
Residue:1159
BDBM50394112
NameBDBM50394112
Synonyms:CHEMBL2158793
TypeSmall organic molecule
Emp. Form.C28H36F2N2O3
Mol. Mass.486.5938
SMILESCc1cc(F)ccc1OC1CCN(CC2CCN(CC2)[C@@](C)(Cc2ccc(F)cc2)C(O)=O)CC1