Reaction Details
TargetPotassium voltage-gated channel subfamily H member 2
LigandBDBM50394114
Substrate/Competitorn/a
Meas. Tech.ChEMBL_856368 (CHEMBL2160723)
IC50 31622.78±n/a nM
Citation Bahl, ABarton, PBowers, KCaffrey, MVDenton, RGilmour, PHawley, SLinannen, TLuckhurst, CAMochel, TPerry, MWRiley, RJRoe, ESpringthorpe, BStein, LWebborn, P Scaffold-hopping with zwitterionic CCR3 antagonists: identification and optimisation of a series with good potency and pharmacokinetics leading to the discovery of AZ12436092. Bioorg Med Chem Lett22:6694-9 (2012) 
 
Potassium voltage-gated channel subfamily H member 2
Name:Potassium voltage-gated channel subfamily H member 2
Type:Multi-pass membrane protein
Mol. Mass.:126672.65
Organism:Homo sapiens (Human)
Description:Q12809
Residue:1159
BDBM50394114
NameBDBM50394114
Synonyms:CHEMBL2158791
TypeSmall organic molecule
Emp. Form.C28H36ClFN2O3
Mol. Mass.503.048
SMILESCc1cc(Cl)ccc1OC1CCN(CC2CCN(CC2)[C@@](C)(Cc2ccc(F)cc2)C(O)=O)CC1