Reaction Details
TargetHistamine H1 receptor
LigandBDBM50394145
Substrate/Competitorn/a
Meas. Tech.ChEMBL_856370 (CHEMBL2160725)
Ki 19.95±n/a nM
Citation Bahl, ABarton, PBowers, KCaffrey, MVDenton, RGilmour, PHawley, SLinannen, TLuckhurst, CAMochel, TPerry, MWRiley, RJRoe, ESpringthorpe, BStein, LWebborn, P Scaffold-hopping with zwitterionic CCR3 antagonists: identification and optimisation of a series with good potency and pharmacokinetics leading to the discovery of AZ12436092. Bioorg Med Chem Lett22:6694-9 (2012) 
 
Histamine H1 receptor
Name:Histamine H1 receptor
Type:G Protein-Coupled Receptor (GPCR)
Mol. Mass.:55808.72
Organism:Homo sapiens (Human)
Description:Cell pellets from SK-N-MC cells transfected with human H1 receptor were used in binding assay.
Residue:487
BDBM50394145
NameBDBM50394145
Synonyms:CHEMBL2158827
TypeSmall organic molecule
Emp. Form.C25H30Cl2N2O3
Mol. Mass.477.423
SMILESOC(=O)Cc1ccc(cc1)N1CCC(CN2CCC(CC2)Oc2ccc(Cl)c(Cl)c2)CC1