Reaction Details
TargetC-C chemokine receptor type 3
LigandBDBM50394117
Substrate/Competitorn/a
Meas. Tech.ChEMBL_856369 (CHEMBL2160724)
Ki 0.501±n/a nM
Citation Bahl, ABarton, PBowers, KCaffrey, MVDenton, RGilmour, PHawley, SLinannen, TLuckhurst, CAMochel, TPerry, MWRiley, RJRoe, ESpringthorpe, BStein, LWebborn, P Scaffold-hopping with zwitterionic CCR3 antagonists: identification and optimisation of a series with good potency and pharmacokinetics leading to the discovery of AZ12436092. Bioorg Med Chem Lett22:6694-9 (2012) 
 
C-C chemokine receptor type 3
Name:C-C chemokine receptor type 3
Type:Enzyme
Mol. Mass.:41053.88
Organism:Homo sapiens (Human)
Description:P51677
Residue:355
BDBM50394117
NameBDBM50394117
Synonyms:CHEMBL2158783
TypeSmall organic molecule
Emp. Form.C27H33Cl2FN2O3
Mol. Mass.523.467
SMILESCc1c(Cl)ccc(OC2CCN(CC3CCN(CC3)[C@@H](Cc3ccc(F)cc3)C(O)=O)CC2)c1Cl