Reaction Details
TargetC-C chemokine receptor type 3
LigandBDBM50394120
Substrate/Competitorn/a
Meas. Tech.ChEMBL_856369 (CHEMBL2160724)
Ki 3.98±n/a nM
Citation Bahl, ABarton, PBowers, KCaffrey, MVDenton, RGilmour, PHawley, SLinannen, TLuckhurst, CAMochel, TPerry, MWRiley, RJRoe, ESpringthorpe, BStein, LWebborn, P Scaffold-hopping with zwitterionic CCR3 antagonists: identification and optimisation of a series with good potency and pharmacokinetics leading to the discovery of AZ12436092. Bioorg Med Chem Lett22:6694-9 (2012) 
 
C-C chemokine receptor type 3
Name:C-C chemokine receptor type 3
Type:Enzyme
Mol. Mass.:41053.88
Organism:Homo sapiens (Human)
Description:P51677
Residue:355
BDBM50394120
NameBDBM50394120
Synonyms:CHEMBL2158780
TypeSmall organic molecule
Emp. Form.C27H34ClFN2O3
Mol. Mass.489.022
SMILESCc1cc(Cl)ccc1OC1CCN(CC2CCN(CC2)[C@@H](Cc2ccc(F)cc2)C(O)=O)CC1