Reaction Details
TargetSerine/threonine-protein kinase SMG1
LigandBDBM50394184
Substrate/Competitorn/a
Meas. Tech.ChEMBL_856497 (CHEMBL2161543)
IC50<0.050000±n/a nM
Citation Gopalsamy, ABennett, EMShi, MZhang, WGBard, JYu, K Identification of pyrimidine derivatives as hSMG-1 inhibitors. Bioorg Med Chem Lett22:6636-41 (2012) 
 
Serine/threonine-protein kinase SMG1
Name:Serine/threonine-protein kinase SMG1
Type:PROTEIN
Mol. Mass.:410490.32
Organism:Homo sapiens (Human)
Description:ChEMBL_856497
Residue:3661
BDBM50394184
NameBDBM50394184
Synonyms:CHEMBL2158860
TypeSmall organic molecule
Emp. Form.C24H23N7O3S
Mol. Mass.489.55
SMILESCNC(=O)Nc1ccc(cc1)-c1cc(ccn1)-c1ccnc(Nc2ccc(C)c(c2)S(N)(=O)=O)n1