Reaction Details
TargetSerine/threonine-protein kinase SMG1
LigandBDBM50394175
Substrate/Competitorn/a
Meas. Tech.ChEMBL_856497 (CHEMBL2161543)
IC50<0.050000±n/a nM
Citation Gopalsamy, ABennett, EMShi, MZhang, WGBard, JYu, K Identification of pyrimidine derivatives as hSMG-1 inhibitors. Bioorg Med Chem Lett22:6636-41 (2012) 
 
Serine/threonine-protein kinase SMG1
Name:Serine/threonine-protein kinase SMG1
Type:PROTEIN
Mol. Mass.:410490.32
Organism:Homo sapiens (Human)
Description:ChEMBL_856497
Residue:3661
BDBM50394175
NameBDBM50394175
Synonyms:CHEMBL2158858
TypeSmall organic molecule
Emp. Form.C23H21N7O3S
Mol. Mass.475.523
SMILESCNC(=O)Nc1ccc(cc1)-c1cc(ccn1)-c1ccnc(Nc2cccc(c2)S(N)(=O)=O)n1