Reaction Details
TargetSerine/threonine-protein kinase SMG1
LigandBDBM50394169
Substrate/Competitorn/a
Meas. Tech.ChEMBL_856497 (CHEMBL2161543)
IC50 80±n/a nM
Citation Gopalsamy, ABennett, EMShi, MZhang, WGBard, JYu, K Identification of pyrimidine derivatives as hSMG-1 inhibitors. Bioorg Med Chem Lett22:6636-41 (2012) 
 
Serine/threonine-protein kinase SMG1
Name:Serine/threonine-protein kinase SMG1
Type:PROTEIN
Mol. Mass.:410490.32
Organism:Homo sapiens (Human)
Description:ChEMBL_856497
Residue:3661
BDBM50394169
NameBDBM50394169
Synonyms:CHEMBL2158851
TypeSmall organic molecule
Emp. Form.C20H18N6O
Mol. Mass.358.3965
SMILESN#Cc1cccc(Nc2nccc(n2)-c2ccnc(c2)N2CCOCC2)c1