Reaction Details
TargetSerine/threonine-protein kinase SMG1
LigandBDBM50394183
Substrate/Competitorn/a
Meas. Tech.ChEMBL_856497 (CHEMBL2161543)
IC50 22±n/a nM
Citation Gopalsamy, ABennett, EMShi, MZhang, WGBard, JYu, K Identification of pyrimidine derivatives as hSMG-1 inhibitors. Bioorg Med Chem Lett22:6636-41 (2012) 
 
Serine/threonine-protein kinase SMG1
Name:Serine/threonine-protein kinase SMG1
Type:PROTEIN
Mol. Mass.:410490.32
Organism:Homo sapiens (Human)
Description:ChEMBL_856497
Residue:3661
BDBM50394183
NameBDBM50394183
Synonyms:CHEMBL2158843
TypeSmall organic molecule
Emp. Form.C18H20N6O3S
Mol. Mass.400.455
SMILESNS(=O)(=O)c1cccc(Nc2nccc(n2)-c2ccnc(NCCCO)c2)c1