Reaction Details
TargetSerine/threonine-protein kinase SMG1
LigandBDBM65549
Substrate/Competitorn/a
Meas. Tech.ChEMBL_856497 (CHEMBL2161543)
IC50 110±n/a nM
Citation Gopalsamy, ABennett, EMShi, MZhang, WGBard, JYu, K Identification of pyrimidine derivatives as hSMG-1 inhibitors. Bioorg Med Chem Lett22:6636-41 (2012) 
 
Serine/threonine-protein kinase SMG1
Name:Serine/threonine-protein kinase SMG1
Type:PROTEIN
Mol. Mass.:410490.32
Organism:Homo sapiens (Human)
Description:ChEMBL_856497
Residue:3661
BDBM65549
NameBDBM65549
Synonyms:3-[[4-[2-(3-chloroanilino)-4-pyrimidinyl]-2-pyridinyl]amino]-1-propanol 3-[[4-[2-(3-chloroanilino)pyrimidin-4-yl]pyridin-2-yl]amino]propan-1-ol MLS000911536 cid_644215
TypeSmall organic molecule
Emp. Form.C18H18ClN5O
Mol. Mass.355.821
SMILESOCCCNc1cc(ccn1)-c1ccnc(Nc2cccc(Cl)c2)n1