Reaction Details
TargetTyrosine-protein phosphatase non-receptor type 1
LigandBDBM50394208
Substrate/Competitorn/a
Meas. Tech.ChEMBL_856703 (CHEMBL2162374)
IC50 17400±n/a nM
Citation Nguyen, PHSharma, GDao, TTUddin, MNKang, KWNdinteh, DTMbafor, JTOh, WK New prenylated isoflavonoids as protein tyrosine phosphatase 1B (PTP1B) inhibitors from Erythrina addisoniae. Bioorg Med Chem20:6459-64 (2012) 
 
Tyrosine-protein phosphatase non-receptor type 1
Name:Tyrosine-protein phosphatase non-receptor type 1
Type:Protein phosphatase
Mol. Mass.:49963.76
Organism:Homo sapiens (Human)
Description:Human recombinant GST-fusion PTP1B (1-435).
Residue:435
BDBM50394208
NameBDBM50394208
Synonyms:CHEMBL2159048
TypeSmall organic molecule
Emp. Form.C25H26O5
Mol. Mass.406.4709
SMILES[#6]\[#6](-[#6])=[#6]\[#6]-c1cc2c(occ(-c3ccc(-[#8])cc3-[#8])c2=O)c(-[#6]\[#6]=[#6](\[#6])-[#6])c1-[#8]