Reaction Details
TargetEpidermal growth factor receptor
LigandBDBM50394210
Substrate/Competitorn/a
Meas. Tech.ChEMBL_856711 (CHEMBL2162537)
IC50 10490±n/a nM
Citation Li, QSLv, XHZhang, YBDong, JJZhou, WPYang, YZhu, HL Identification of novel 3,5-diarylpyrazoline derivatives containing salicylamide moiety as potential anti-melanoma agents. Bioorg Med Chem Lett22:6596-601 (2012) 
 
Epidermal growth factor receptor
Name:Epidermal growth factor receptor
Type:Receptor Kinase Domain
Mol. Mass.:134279.59
Organism:Homo sapiens (Human)
Description:P00533
Residue:1210
BDBM50394210
NameBDBM50394210
Synonyms:CHEMBL2159053
TypeSmall organic molecule
Emp. Form.C23H18Cl2N2O3
Mol. Mass.441.307
SMILESCOc1ccc(cc1)C1=NN(C(C1)c1ccc(Cl)cc1)C(=O)c1ccc(Cl)cc1O