Reaction Details
TargetPeroxisome proliferator-activated receptor delta
LigandBDBM50394342
Substrate/Competitorn/a
Meas. Tech.ChEMBL_857113 (CHEMBL2162787)
EC50 15600±n/a nM
Citation Quang, THNgan, NTMinh, CVKiem, PVYen, PHTai, BHNhiem, NXThao, NPAnh, Hle TLuyen, BTYang, SYChoi, CWKim, YH Diarylheptanoid glycosides from Tacca plantaginea and their effects on NF-¿B activation and PPAR transcriptional activity. Bioorg Med Chem Lett22:6681-7 (2012) 
 
Peroxisome proliferator-activated receptor delta
Name:Peroxisome proliferator-activated receptor delta
Type:Enzyme
Mol. Mass.:49910.45
Organism:Homo sapiens (Human)
Description:Q03181
Residue:441
BDBM50394342
NameBDBM50394342
Synonyms:CHEMBL458899
TypeSmall organic molecule
Emp. Form.C25H34O10
Mol. Mass.494.5315
SMILESOC[C@H]1O[C@@H](O[C@H](CCc2ccc(O)c(O)c2)C[C@H](O)CCc2ccc(O)cc2)[C@H](O)[C@@H](O)[C@@H]1O