Reaction Details
TargetPeroxisome proliferator-activated receptor gamma
LigandBDBM50394346
Substrate/Competitorn/a
Meas. Tech.ChEMBL_857112 (CHEMBL2162786)
EC50>50000±n/a nM
Citation Quang, THNgan, NTMinh, CVKiem, PVYen, PHTai, BHNhiem, NXThao, NPAnh, Hle TLuyen, BTYang, SYChoi, CWKim, YH Diarylheptanoid glycosides from Tacca plantaginea and their effects on NF-¿B activation and PPAR transcriptional activity. Bioorg Med Chem Lett22:6681-7 (2012) 
 
Peroxisome proliferator-activated receptor gamma
Name:Peroxisome proliferator-activated receptor gamma
Type:Nuclear Receptor
Mol. Mass.:57613.46
Organism:Homo sapiens (Human)
Description:P37231
Residue:505
BDBM50394346
NameBDBM50394346
Synonyms:CHEMBL2159605
TypeSmall organic molecule
Emp. Form.C31H42O15
Mol. Mass.654.6562
SMILESOC[C@H]1O[C@@H](Oc2ccc(CCCCC(=O)CCc3ccc(O[C@@H]4O[C@H](CO)[C@@H](O)[C@H](O)[C@H]4O)c(O)c3)cc2O)[C@H](O)[C@@H](O)[C@@H]1O